{"text_format":"3","workbook":"xlsx","n_sheets":8,"sheets":["Titelblatt","Erläuterungen","Endenergiepotenzial","Endenergiebedarf Ist","Endenergiebedarf 2030","Endenergiebedarf 2040","Kommunen","Export"],"not_rendered":{"images":1,"comments":3},"read":"whole","date_system":"1900"}

{"sheet":"Titelblatt","index":0,"n_rows":24,"n_cols":7,"rows_kept":24}
{"$rows_empty":8}
[null,null,"Arbeitshilfe zur Übermittlung der Daten der Wärmeplanung gemäß § 27 Absatz 4 Satz 2 Nr. 1 - 3 KlimaG Baden-Württemberg"]
[]
[null,null,"Die Nutzung dieses Templates ist verpflichtend zur Einreichung der Daten in die vom Land Baden-Württemberg bereitgestellte elektronische Datenbank."]
[null,null,"Änderungen am Template sind nicht zulässig."]
[null,null,"Damit wird eine einfache und sichere Datenverarbeitung sichergestellt."]
[]
[]
[null,null,"Version 1.2",null,"Stand: 07.12.2023",null,"TSt"]
[]
[null,null,"Im Auftrag des Ministeriums für Umwelt, Klima und Energiewirtschaft Baden-Württemberg"]
[]
[]
[null,null,"Erstellt von","KEA Klimaschutz- und Energieagentur Baden-Württemberg GmbH"]
[{"$nulls":3},"Kaiserstr. 94a"]
[{"$nulls":3},"76133 Karlsruhe"]
[{"$nulls":3},"www.kea-bw.de"]

{"sheet":"Erläuterungen","index":1,"n_rows":66,"n_cols":3,"rows_kept":66}
[]
[]
[null,"Erläuterungen / Beschreibungen"]
[]
[null,"Arbeitsblatt Endenergiepotenzial"]
[null,"Grundlage: § 27 Absatz 4 Satz 2 Nr. 3 KlimaG BW"]
[null,"Nutzbares Endenergiepotenzial zur klimaneutralen Wärmeversorgung aus erneuerbaren Energien sowie Abwärme und Kraft-Wärme-Kopplung"]
[]
[null,null,"Diese Eingaben sind verpflichtend auszufüllen"]
[null,null,"Diese Eingaben sind freiwillig auszufüllen"]
[null,null,"automatische Rechenfelder, schreibgeschützt"]
[null,0,"Wenn kein Potenzial verfügbar --> 0 eintragen"]
[]
[null,"Bitte zunächst den offiziellen Namen der Gemeinde, für die Daten übermittelt werden sollen, aus der Klappbox in Zelle A3 auswählen."]
[null,"Manche Gemeinden haben ähnliche Namen. In diesem Fall wurde zwecks Unterscheidung dem offiziellen Gemeindenamen ein Zusatz, wie z.B. \"(Baden)\" oder \"an der …\", hinzugefügt."]
[null,"Bitte achten Sie darauf, die richtige Gemeinde auszuwählen, da ansonsten das Template nicht hochgeladen werden kann."]
[]
[null,"Bitte tragen Sie in Zelle B3  das Jahr der Potenzialermittlung ein!"]
[]
[null,"Alle Eingaben erfolgen in MWh/a."]
[]
[null,"Bitte tragen Sie die nutzbaren Endenergiemengen ein, die nach Ihren Berechnungen maximal aus lokalen erneuerbaren Quellen bereitgestellt werden können."]
[]
[null,"Bitte füllen Sie sofern entsprechende Daten verfügbar sind, auch die grünen Felder aus. "]
[null,"Damit ergibt sich eine genauer Überblick über die insgesamt in Baden-Württemberg verfügbaren, und aus lokaler Sicht nutzbaren erneuerbaren Potenziale."]
[]
[null,"Bitte tragen Sie auch ein Abschätzung des Stromverbrauchs zum Betrieb der Wärmepumpen der jeweiligen Kategorien ein."]
[]
[]
[null,"Arbeitsblatt Endenergiebedarf Ist"]
[null,"Grundlage: § 27 Absatz 4 Satz 2 Nr. 1 KlimaG BW"]
[null,"* Für das Ist-Jahr Endenergiebedarf bzw. -verbrauch für die Wärmeversorgung, aufgeteilt nach Energieträgern und Sektoren"]
[null,"* Für das Ist-Jahr Energieeinsatz zur Wärmeerzeugung in Wärmenetzen"]
[]
[null,null,"Diese Eingaben sind verpflichtend auszufüllen"]
[null,null,"Diese Eingaben sind freiwillig auszufüllen"]
[null,null,"automatische Rechenfelder, schreibgeschützt"]
[]
[null,"Bitte tragen Sie in Zelle A3  das Jahr der Datenerhebung ein!"]
[]
{"$rows_left_out":27}
{"sheet":"Endenergiepotenzial","index":2,"n_rows":85,"n_cols":4,"rows_kept":85,"merged":[[0,0,0,1]]}
["Nutzbares Endenergiepotenzial\naus erneuerbaren Energien, Abwärme und KWK"]
["Kommune","Jahr"]
[{"$nulls":3},"offiziellen Gemeindenamen aus Drop-Box auswählen und\nJahr der Potenzialermittlung eintragen!"]
[]
["Energieträger","MWh/a"]
["Biomasse"]
["Nachwachsende Rohstoffe (NaWaRo) insgesamt",null,null,"Summe aus Holz und sonstigen nachwachsenden Rohstoffen"]
[]
["davon feste Biomasse (Holz)",null,null,"unter Abzug anderer Nutzungen verfügbares Potenzial"]
["Brennholz (Waldrestholz)"]
["Holzhackschnitzel (Waldrestholz)"]
["Holzhackschnitzel (sonstige Flächen)"]
["Sägereste"]
["Sonstiges Holz außer Altholz"]
[]
["davon Andere NaWaRo",null,null,"unter Abzug anderer Nutzungen verfügbares Potenzial"]
["Gülle"]
["Mais"]
["Raps"]
["Sonstige Feldfrüchte"]
["Kurzumtriebsplantagen"]
["Ernteabfälle feucht"]
["Stroh"]
["Sonstige NaWaRo"]
[]
["Abfälle",null,null,"in lokalen Anlagen genutzter Abfall; nicht der Abfallanfall in der Kommune"]
["Biogener Anteile des Abfalls"]
["Altholz"]
["Sonstige Siedlungsabfälle etc."]
[]
["Klärgas",null,null,"in lokalen Anlagen genutztes Klärgas"]
[]
["Deponiegas",null,null,"in lokalen Anlagen genutztes Deponiegas, das noch mindestens bis 2030 verfügbar ist"]
[]
["Summe KWK-Wärmeerzeugung",null,null,"Summe der mit KWK-Anlagen erzeugten und genutzten Wärme"]
[]
["Solarthermie Dach-Anlagen",null,null,"Nutzbare Anteile zur Deckung des Warmwasserbedarfs und zur Unterstützung der Heizwärme unter Berücksichtigung der PV-Dachflächen "]
[]
["Solarthermie Freiflächen-Anlagen",null,null,"maximal sinnvoller Anteil an Bodenfläche"]
[]
{"$rows_left_out":46}
{"sheet":"Endenergiebedarf Ist","index":3,"n_rows":31,"n_cols":24,"rows_kept":31,"merged":[[1,3,1,13],[11,1,11,21],[11,22,11,23]]}
["Endenergiebedarf bzw. -verbrauch MWh/a"]
[{"$f":"+Endenergiepotenzial!A3","v":0},"Endenergiebedarf \n/-verbrauch","Endenergiebedarf \n/-verbrauch","Endenergiebedarf /-verbrauch dezentrale Wärmeversorgung"]
[null,"Strom\n(abzgl. WP-Strom und Direktheizung)","Wärmenetze","Heizöl, fossil","Erdgas, fossil","Wasserstoff, inkl. Beimischung zu Erdgas","Synt. Brennstoffe (PtX)","Solarthermie","Biomasse","Luft-Wärmepumpe (Umweltwärme + WP-Strom)","Erdwärme-Wärmepumpe Umweltwärme + WP-Strom)","Gewässer-Wärmepumpe (Umweltwärme + WP-Strom)","Direktstrom","Feste fossile Brennstoffe","Summe Endenergiebedarf /-verbrauch Wärme"]
["Private Haushalte / Wohnungen (1)",{"$nulls":13},{"$f":"SUM(C4:N4)","v":0}]
["Gewerbe und Sonstiges (2)",{"$nulls":13},{"$f":"SUM(C5:N5)","v":0}]
["Verarbeitendes Gewerbe (3)",{"$nulls":13},0]
["Kommunale Liegenschaften (4)",{"$nulls":13},0]
["Summe",{"$f":"SUM(B4:B7)","v":0},0,0,0,0,0,0,0,0,0,0,0,{"$f":"SUM(N4:N7)","v":0},{"$f":"SUM(O4:O7)","v":0}]
[]
[]
["Energieeinsatz zur Wärmeerzeugung in Wärmenetzen MWh/a"]
[{"$f":"+A2","v":0},"Energieeinsatz (Heizwert) zur Wärmeerzeugung in Wärmenetzen\nabzüglich KWK-Stromerzeugung",{"$nulls":20},"KWK-Erzeugung"]
[{"$f":"+A3","v":0},"Heizöl, fossil","Erdgas, fossil","Steinkohle, Braunkohle","Wasserstoff","Synt. Brennstoffe","Biogas","Klärgas und Deponiegas","Solarthermie","Biomasse","Luft-Wärmepumpe (Umweltwärme + WP-Strom)","Erdwärme-Wärmepumpe (Umweltwärme + WP-Strom)","Gewässer-Wärmepumpe (Umweltwärme + WP-Strom)","Industrielle Abwärme (Niedertemp. + WP-Strom)","Industrielle Abwärme (Hochtemp. direkte Nutzung)","Abwasser-Wärmepumpe (Umweltwärme + WP-Strom)","Tiefe Geothermie","Abfall","EE-Direktstrom","Sonstige fossile Brennstoffe","Sonstige erneuerbare Brennstoffe","Summe Wärmenetz-erzezugung","KWK-Wärme-erzeugung","KWK-Strom-erzeugung"]
[{"$nulls":21},{"$f":"SUM(B14:U14)","v":0}]
[]
[]
[null,null,"Diese Eingaben sind verpflichtend auszufüllen"]
[null,null,"Diese Eingaben sind freiwillig auszufüllen"]
[null,null,"automatische Rechenfelder"]
[]
["Zellen","Kommentar"]
["A1, B2, C2, D-N2, O3","Bei der Energiebilanzierung wird meist vom Endenergieverbrauch statt vom Energiebedarf gesprochen. Siehe z. B. BISKO-Bilanzierungssystematik Kommunal."]
[null,"Energieverbrauch bezeichnet eine gemessene Größe - Verbrauchsmessung. Energiebedarf bezeichnet eine berechnete Größe, z.B. den mit einem Simulationsmodell berechneten Heizenergiebedarf eines Gebäudes."]
[null,"Für die Erstellung der Ist-Bilanz empfehlen wir die Berechnung des Endenergieverbrauchs gemäß BISKO-Standard unter Einbeziehung gemessener Verbrauchswerte (z.B. Daten der Energieversorger)."]
["B4-7","Angaben zum Stromverbrauch sind freiwillig."]
["A2","offizieller Gemeindename, übernommen aus Arbeitsblatt Endenergiepotenzial"]
["A3","Jahr der Datenerhebung eintragen!"]
["A5","Abteilungen A, B und D-U der Klassifizierung der Wirtschaftszweige WZ 2008"]
["A6","Abteilung C der Klassifizierung der Wirtschaftszweige WZ 2008"]
["B-N7","Verbrauch der kommunalen Liegenschaften; Doppelzählung bei Gewerbe und Sonstiges vermeiden"]
["J4-L7, K-M14","Bitte tragen Sie für Wärrmepumpen den Stromverbrauch plus die Energiemenge der eingesetzten Wärmequelle (Luft, Erdwärme, Grundwasser etc.) ein."]

{"sheet":"Endenergiebedarf 2030","index":4,"n_rows":27,"n_cols":24,"rows_kept":27,"merged":[[1,3,1,13],[11,1,11,21],[11,22,11,23]]}
["Endenergiebedarf MWh/a"]
[{"$f":"+Endenergiepotenzial!A3","v":0},"Endenergie- \nbedarf","Endenergie- \nbedarf","Endenergiebedarf dezentrale Wärmeversorgung"]
[2030,"Strom\n(abzgl. WP-Strom und Direktheizung)","Wärmenetze","Heizöl, fossil","Erdgas, fossil","Wasserstoff, inkl. Beimischung zu Erdgas","Synt. Brennstoffe (PtX)","Solarthermie","Biomasse","Luft-Wärmepumpe (Umweltwärme + WP-Strom)","Erdwärme-Wärmepumpe (Umweltwärme + WP-Strom)","Gewässer-Wärmepumpe (Umweltwärme + WP-Strom)","Direktstrom","Feste fossile Brennstoffe","Summe Endenergiebedarf Wärme"]
["Private Haushalte / Wohnungen (1)",{"$nulls":13},{"$f":"SUM(C4:N4)","v":0}]
["Gewerbe und Sonstiges (2)",{"$nulls":13},{"$f":"SUM(C5:N5)","v":0}]
["Verarbeitendes Gewerbe (3)",{"$nulls":13},0]
["Kommunale Liegenschaften (4)",{"$nulls":13},0]
["Summe",{"$f":"SUM(B4:B7)","v":0},0,0,0,0,0,0,0,0,0,0,0,{"$f":"SUM(N4:N7)","v":0},{"$f":"SUM(O4:O7)","v":0}]
[]
[]
["Energieeinsatz zur Wärmeerzeugung in Wärmenetzen MWh/a"]
[{"$f":"+A2","v":0},"Energieeinsatz (Heizwert) zur Wärmeerzeugung in Wärmenetzen\nabzüglich KWK-Stromerzeugung",{"$nulls":20},"KWK-Erzeugung"]
[{"$f":"+A3","v":2030},"Heizöl, fossil","Erdgas, fossil","Steinkohle, Braunkohle","Wasserstoff","Synt. Brennstoffe","Biogas","Klärgas und Deponiegas","Solarthermie","Biomasse","Luft-Wärmepumpe (Umweltwärme + WP-Strom)","Erdwärme-Wärmepumpe (Umweltwärme + WP-Strom)","Gewässer-Wärmepumpe (Umweltwärme + WP-Strom)","Industrielle Abwärme (Niedertemp. + WP-Strom)","Industrielle Abwärme (Hochtemp. direkte Nutzung)","Abwasser-Wärmepumpe (Umweltwärme + WP-Strom)","Tiefe Geothermie","Abfall","EE-Direktstrom","Sonstige fossile Brennstoffe","Sonstige erneuerbare Brennstoffe","Summe Wärmenetz-erzezugung","KWK-Wärme-erzeugung","KWK-Strom-erzeugung"]
[{"$nulls":21},{"$f":"SUM(B14:U14)","v":0}]
[]
[]
[null,null,"Diese Eingaben sind verpflichtend auszufüllen"]
[null,null,"Diese Eingaben sind freiwillig auszufüllen"]
[null,null,"automatische Rechenfelder"]
[]
["Zellen","Kommentar"]
["B4-7","Angaben zum Strombedarf sind freiwillig"]
["A2","offizieller Gemeindename, übernommen aus Arbeitsblatt Endenergiepotenzial"]
["A5","Abteilungen A, B und D-U der Klassifizierung der Wirtschaftszweige WZ 2008"]
["A6","Abteilung C der Klassifizierung der Wirtschaftszweige WZ 2008"]
["B-N7","Bedarf der kommunalen Liegenschaften; Doppelzählung bei Gewerbe und Sonstiges vermeiden"]
["J4-L7, K-M14","Bitte tragen Sie für Wärrmepumpen den Strombedarf plus die Energiemenge der eingesetzten Wärmequelle (Luft, Erdwärme, Grundwasser etc.) ein."]

{"sheet":"Endenergiebedarf 2040","index":5,"n_rows":27,"n_cols":24,"rows_kept":27,"merged":[[1,3,1,13],[11,1,11,21],[11,22,11,23]]}
["Endenergiebedarf MWh/a"]
[{"$f":"+Endenergiepotenzial!A3","v":0},"Endenergie- \nbedarf","Endenergie- \nbedarf","Endenergiebedarf dezentrale Wärmeversorgung"]
[2040,"Strom\n(abzgl. WP-Strom und Direktheizung)","Wärmenetze","Heizöl, fossil","Erdgas, fossil","Wasserstoff, inkl. Beimischung zu Erdgas","Synt. Brennstoffe (PtX)","Solarthermie","Biomasse","Luft-Wärmepumpe (Umweltwärme + WP-Strom)","Erdwärme-Wärmepumpe (Umweltwärme + WP-Strom)","Gewässer-Wärmepumpe (Umweltwärme + WP-Strom)","Direktstrom","Feste fossile Brennstoffe","Summe Endenergiebedarf Wärme"]
["Private Haushalte / Wohnungen (1)",{"$nulls":13},{"$f":"SUM(C4:N4)","v":0}]
["Gewerbe und Sonstiges (2)",{"$nulls":13},{"$f":"SUM(C5:N5)","v":0}]
["Verarbeitendes Gewerbe (3)",{"$nulls":13},0]
["Kommunale Liegenschaften (4)",{"$nulls":13},0]
["Summe",{"$f":"SUM(B4:B7)","v":0},0,0,0,0,0,0,0,0,0,0,0,{"$f":"SUM(N4:N7)","v":0},{"$f":"SUM(O4:O7)","v":0}]
[]
[]
["Energieeinsatz zur Wärmeerzeugung in Wärmenetzen MWh/a"]
[{"$f":"+A2","v":0},"Energieeinsatz (Heizwert) zur Wärmeerzeugung in Wärmenetzen\nabzüglich KWK-Stromerzeugung",{"$nulls":20},"KWK-Erzeugung"]
[{"$f":"+A3","v":2040},"Heizöl, fossil","Erdgas, fossil","Steinkohle, Braunkohle","Wasserstoff","Synt. Brennstoffe","Biogas","Klärgas und Deponiegas","Solarthermie","Biomasse","Luft-Wärmepumpe (Umweltwärme + WP-Strom)","Erdwärme-Wärmepumpe (Umweltwärme + WP-Strom)","Gewässer-Wärmepumpe (Umweltwärme + WP-Strom)","Industrielle Abwärme (Niedertemp. + WP-Strom)","Industrielle Abwärme (Hochtemp. direkte Nutzung)","Abwasser-Wärmepumpe (Umweltwärme + WP-Strom)","Tiefe Geothermie","Abfall","EE-Direktstrom","Sonstige fossile Brennstoffe","Sonstige erneuerbare Brennstoffe","Summe Wärmenetz-erzezugung","KWK-Wärme-erzeugung","KWK-Strom-erzeugung"]
[{"$nulls":21},{"$f":"SUM(B14:U14)","v":0}]
[]
[]
[null,null,"Diese Eingaben sind verpflichtend auszufüllen"]
[null,null,"Diese Eingaben sind freiwillig auszufüllen"]
[null,null,"automatische Rechenfelder"]
[]
["Zellen","Kommentar"]
["B4-7","Angaben zum Strombedarf sind freiwillig"]
["A2","offizieller Gemeindename, übernommen aus Arbeitsblatt Endenergiepotenzial"]
["A5","Abteilungen A, B und D-U der Klassifizierung der Wirtschaftszweige WZ 2008"]
["A6","Abteilung C der Klassifizierung der Wirtschaftszweige WZ 2008"]
["B-N7","Bedarf der kommunalen Liegenschaften; Doppelzählung bei Gewerbe und Sonstiges vermeiden"]
["J4-L7, K-M14","Bitte tragen Sie für Wärrmepumpen den Strombedarf plus die Energiemenge der eingesetzten Wärmequelle (Luft, Erdwärme, Grundwasser etc.) ein."]

{"sheet":"Kommunen","index":6,"n_rows":1102,"n_cols":3,"rows_kept":1102,"hidden":true}
["Eindeutige Namen der Kommunen","GKZ","Einige Kommunen haben den gleichen Ortsnamen, deswegen wurden die Landkreise angefügt"]
["Aach, Stadt",335001]
["Aalen, Stadt",136088]
["Abstatt",125001]
["Abtsgmünd",136002]
["Achberg",436001]
["Achern, Stadt",317001]
["Achstetten",426001]
["Adelberg",117001]
["Adelmannsfelden",136003]
["Adelsheim, Stadt",225001]
["Affalterbach",118001]
["Aglasterhausen",225002]
["Ahorn",128138]
["Aichelberg",117002]
["Aichhalden",325001]
["Aichstetten",436003]
["Aichtal, Stadt",116081]
["Aichwald",116076]
["Aidlingen",115001]
["Aitern",336004]
["Aitrach",436004]
["Albbruck",337002]
["Albershausen",117003]
["Albstadt, Stadt",417079]
["Aldingen",327002]
["Alfdorf",119001]
["Allensbach",335002]
["Alleshausen",426005]
["Allmannsweiler",426006]
["Allmendingen",425002]
["Allmersbach im Tal",119003]
["Alpirsbach, Stadt",237002]
["Altbach",116004]
["Altdorf_BB",115002]
["Altdorf_ES",116005]
["Altenriet",116006]
["Altensteig, Stadt",235006]
["Altheim (Alb)",425005]
["Altheim_BC",426008]
{"$rows_left_out":1063}
{"sheet":"Export","index":7,"n_rows":334,"n_cols":6,"rows_kept":334,"hidden":true}
["Region",{"$f":"+Endenergiepotenzial!A3","v":0},null,null,{"$f":"+Endenergiepotenzial!B3","v":0},"Jahr Potenzialberechnung"]
["Regionalschlüssel",{"$f":"VLOOKUP(B1,Kommunen!A2:B1102,2,)","v":{"$error":"#N/A"}},null,null,{"$f":"+'Endenergiebedarf Ist'!A3","v":0},"Jahr Ist-Energiebilanz"]
["Merkmal","Kommunale Wärmeplanung"]
[]
["Attribut","Energieträger","Sektor","Einheit","Jahr","Wert"]
["Endenergiepotenzial","Biomasse insgesamt",null,"MWh/a",{"$f":"+Endenergiepotenzial!$B$3","v":0},{"$f":"+Endenergiepotenzial!B6","v":0}]
["Endenergiepotenzial","NaWaRo insgesamt",null,"MWh/a",{"$f":"+Endenergiepotenzial!$B$3","v":0},{"$f":"+Endenergiepotenzial!B7","v":0}]
["Endenergiepotenzial","feste Biomasse (Holz) insgesamt",null,"MWh/a",{"$f":"+Endenergiepotenzial!$B$3","v":0},{"$f":"+Endenergiepotenzial!B9","v":0}]
["Endenergiepotenzial",{"$f":"+Endenergiepotenzial!A10","v":"Brennholz (Waldrestholz)"},null,"MWh/a",{"$f":"+Endenergiepotenzial!$B$3","v":0},{"$f":"+Endenergiepotenzial!B10","v":0}]
["Endenergiepotenzial",{"$f":"+Endenergiepotenzial!A11","v":"Holzhackschnitzel (Waldrestholz)"},null,"MWh/a",{"$f":"+Endenergiepotenzial!$B$3","v":0},{"$f":"+Endenergiepotenzial!B11","v":0}]
["Endenergiepotenzial",{"$f":"+Endenergiepotenzial!A12","v":"Holzhackschnitzel (sonstige Flächen)"},null,"MWh/a",{"$f":"+Endenergiepotenzial!$B$3","v":0},{"$f":"+Endenergiepotenzial!B12","v":0}]
["Endenergiepotenzial",{"$f":"+Endenergiepotenzial!A13","v":"Sägereste"},null,"MWh/a",{"$f":"+Endenergiepotenzial!$B$3","v":0},{"$f":"+Endenergiepotenzial!B13","v":0}]
["Endenergiepotenzial",{"$f":"+Endenergiepotenzial!A14","v":"Sonstiges Holz außer Altholz"},null,"MWh/a",{"$f":"+Endenergiepotenzial!$B$3","v":0},{"$f":"+Endenergiepotenzial!B14","v":0}]
["Endenergiepotenzial","Andere NaWaRo insgesamt",null,"MWh/a",{"$f":"+Endenergiepotenzial!$B$3","v":0},{"$f":"+Endenergiepotenzial!B16","v":0}]
["Endenergiepotenzial",{"$f":"+Endenergiepotenzial!A17","v":"Gülle"},null,"MWh/a",{"$f":"+Endenergiepotenzial!$B$3","v":0},{"$f":"+Endenergiepotenzial!B17","v":0}]
["Endenergiepotenzial",{"$f":"+Endenergiepotenzial!A18","v":"Mais"},null,"MWh/a",{"$f":"+Endenergiepotenzial!$B$3","v":0},{"$f":"+Endenergiepotenzial!B18","v":0}]
["Endenergiepotenzial",{"$f":"+Endenergiepotenzial!A19","v":"Raps"},null,"MWh/a",{"$f":"+Endenergiepotenzial!$B$3","v":0},{"$f":"+Endenergiepotenzial!B19","v":0}]
["Endenergiepotenzial",{"$f":"+Endenergiepotenzial!A20","v":"Sonstige Feldfrüchte"},null,"MWh/a",{"$f":"+Endenergiepotenzial!$B$3","v":0},{"$f":"+Endenergiepotenzial!B20","v":0}]
["Endenergiepotenzial",{"$f":"+Endenergiepotenzial!A21","v":"Kurzumtriebsplantagen"},null,"MWh/a",{"$f":"+Endenergiepotenzial!$B$3","v":0},{"$f":"+Endenergiepotenzial!B21","v":0}]
["Endenergiepotenzial",{"$f":"+Endenergiepotenzial!A22","v":"Ernteabfälle feucht"},null,"MWh/a",{"$f":"+Endenergiepotenzial!$B$3","v":0},{"$f":"+Endenergiepotenzial!B22","v":0}]
["Endenergiepotenzial",{"$f":"+Endenergiepotenzial!A23","v":"Stroh"},null,"MWh/a",{"$f":"+Endenergiepotenzial!$B$3","v":0},{"$f":"+Endenergiepotenzial!B23","v":0}]
["Endenergiepotenzial",{"$f":"+Endenergiepotenzial!A24","v":"Sonstige NaWaRo"},null,"MWh/a",{"$f":"+Endenergiepotenzial!$B$3","v":0},{"$f":"+Endenergiepotenzial!B24","v":0}]
["Endenergiepotenzial","Abfälle insgesamt",null,"MWh/a",{"$f":"+Endenergiepotenzial!$B$3","v":0},{"$f":"+Endenergiepotenzial!B26","v":0}]
["Endenergiepotenzial",{"$f":"+Endenergiepotenzial!A27","v":"Biogener Anteile des Abfalls"},null,"MWh/a",{"$f":"+Endenergiepotenzial!$B$3","v":0},{"$f":"+Endenergiepotenzial!B27","v":0}]
["Endenergiepotenzial",{"$f":"+Endenergiepotenzial!A28","v":"Altholz"},null,"MWh/a",{"$f":"+Endenergiepotenzial!$B$3","v":0},{"$f":"+Endenergiepotenzial!B28","v":0}]
["Endenergiepotenzial",{"$f":"+Endenergiepotenzial!A29","v":"Sonstige Siedlungsabfälle etc."},null,"MWh/a",{"$f":"+Endenergiepotenzial!$B$3","v":0},{"$f":"+Endenergiepotenzial!B29","v":0}]
["Endenergiepotenzial",{"$f":"+Endenergiepotenzial!A31","v":"Klärgas"},null,"MWh/a",{"$f":"+Endenergiepotenzial!$B$3","v":0},{"$f":"+Endenergiepotenzial!B31","v":0}]
["Endenergiepotenzial",{"$f":"+Endenergiepotenzial!A33","v":"Deponiegas"},null,"MWh/a",{"$f":"+Endenergiepotenzial!$B$3","v":0},{"$f":"+Endenergiepotenzial!B33","v":0}]
["Endenergiepotenzial",{"$f":"+Endenergiepotenzial!A35","v":"Summe KWK-Wärmeerzeugung"},null,"MWh/a",{"$f":"+Endenergiepotenzial!$B$3","v":0},{"$f":"+Endenergiepotenzial!B35","v":0}]
["Endenergiepotenzial","Solarthermie Dachanlagen",null,"MWh/a",{"$f":"+Endenergiepotenzial!$B$3","v":0},{"$f":"+Endenergiepotenzial!B37","v":0}]
["Endenergiepotenzial","Solarthermie Freiflächenanlagen",null,"MWh/a",{"$f":"+Endenergiepotenzial!$B$3","v":0},{"$f":"+Endenergiepotenzial!B39","v":0}]
["Endenergiepotenzial","Oberflächennahe Geothermie (Erdwärme) insgesamt",null,"MWh/a",{"$f":"+Endenergiepotenzial!$B$3","v":0},{"$f":"+Endenergiepotenzial!B41","v":0}]
["Endenergiepotenzial",{"$f":"+Endenergiepotenzial!A42","v":"Stromverbrauch für Erdwärme-Wärmepumpen"},null,"MWh/a",{"$f":"+Endenergiepotenzial!$B$3","v":0},{"$f":"+Endenergiepotenzial!B42","v":0}]
["Endenergiepotenzial",{"$f":"+Endenergiepotenzial!A43","v":"Erdwärme Erdsonden"},null,"MWh/a",{"$f":"+Endenergiepotenzial!$B$3","v":0},{"$f":"+Endenergiepotenzial!B43","v":0}]
["Endenergiepotenzial",{"$f":"+Endenergiepotenzial!A44","v":"Erdwärme Erdkollektoren"},null,"MWh/a",{"$f":"+Endenergiepotenzial!$B$3","v":0},{"$f":"+Endenergiepotenzial!B44","v":0}]
["Endenergiepotenzial",{"$f":"+Endenergiepotenzial!A45","v":"Erdwärme Grundwasser"},null,"MWh/a",{"$f":"+Endenergiepotenzial!$B$3","v":0},{"$f":"+Endenergiepotenzial!B45","v":0}]
["Endenergiepotenzial","Umweltwärme insgesamt",null,"MWh/a",{"$f":"+Endenergiepotenzial!$B$3","v":0},{"$f":"+Endenergiepotenzial!B47","v":0}]
["Endenergiepotenzial",{"$f":"+Endenergiepotenzial!A48","v":"Stromverbrauch für Umweltwärme-Wärmepumpen"},null,"MWh/a",{"$f":"+Endenergiepotenzial!$B$3","v":0},{"$f":"+Endenergiepotenzial!B48","v":0}]
["Endenergiepotenzial",{"$f":"+Endenergiepotenzial!A49","v":"Umweltwärme Oberflächengewässer (See, Fluss)"},null,"MWh/a",{"$f":"+Endenergiepotenzial!$B$3","v":0},{"$f":"+Endenergiepotenzial!B49","v":0}]
["Endenergiepotenzial",{"$f":"+Endenergiepotenzial!A50","v":"Umweltwärme unterirdische Bauwerke"},null,"MWh/a",{"$f":"+Endenergiepotenzial!$B$3","v":0},{"$f":"+Endenergiepotenzial!B50","v":0}]
{"$rows_left_out":294}